Reaction Details
TargetTyrosine-protein kinase JAK2
LigandBDBM174029
Substrate/Competitorn/a
Meas. Tech.JAK2 Kinase Assay
IC50 5.00±n/a nM
Citation Brasca, MGBindi, SCaldarelli, MNesi, MOrrenius, SCPanzeri, A Substituted pyrroles active as kinases inhibitors US Patent US9688661 Publication Date 6/27/2017
 
Tyrosine-protein kinase JAK2
Name:Tyrosine-protein kinase JAK2
Type:Protein
Mol. Mass.:130684.68
Organism:Homo sapiens (Human)
Description:O60674
Residue:1132
BDBM174029
NameBDBM174029
Synonyms:US9688661, 5-(6-Aminopyrimidin-4-yl)-2-(5-chloro-2-ethylphenyl)-N-methyl-1H-pyrrole-3-carboxamide (compd 301)
TypeSmall organic molecule
Emp. Form.C19H20ClN5O
Mol. Mass.369.848
SMILESCCc1ccc(Cl)cc1-c1c(cc(-c2cc(N)ncn2)n1C)C(=O)NC