Reaction Details
TargetNon-receptor tyrosine-protein kinase TYK2 [833-1187]
LigandBDBM173936
Substrate/Competitorn/a
Meas. Tech.TYK2 Kinase Assay
IC50 12±n/a nM
Citation Brasca, MGBindi, SCaldarelli, MNesi, MOrrenius, SCPanzeri, A Substituted pyrroles active as kinases inhibitors US Patent US9688661 Publication Date 6/27/2017
 
Non-receptor tyrosine-protein kinase TYK2 [833-1187]
Name:Non-receptor tyrosine-protein kinase TYK2 [833-1187]
Type:Protein
Mol. Mass.:40613.06
Organism:Homo sapiens (Human)
Description:Human TYK2 variant (833-1187 aa)
Residue:355
BDBM173936
NameBDBM173936
Synonyms:US9688661, 1-(5-Chloro-2-ethylphenyl)-4-(7H-pyrrolo[2,3-d]pyrimidin-4-yl)-1H-pyrrole-2-carbonitrile (compd 68)
TypeSmall organic molecule
Emp. Form.C19H14ClN5
Mol. Mass.347.801
SMILESCCc1ccc(Cl)cc1-n1cc(cc1C#N)-c1ncnc2[nH]ccc12