Reaction Details
TargetNon-receptor tyrosine-protein kinase TYK2 [833-1187]
LigandBDBM173973
Substrate/Competitorn/a
Meas. Tech.TYK2 Kinase Assay
IC50 7.00±n/a nM
Citation Brasca, MGBindi, SCaldarelli, MNesi, MOrrenius, SCPanzeri, A Substituted pyrroles active as kinases inhibitors US Patent US9688661 Publication Date 6/27/2017
 
Non-receptor tyrosine-protein kinase TYK2 [833-1187]
Name:Non-receptor tyrosine-protein kinase TYK2 [833-1187]
Type:Protein
Mol. Mass.:40613.06
Organism:Homo sapiens (Human)
Description:Human TYK2 variant (833-1187 aa)
Residue:355
BDBM173973
NameBDBM173973
Synonyms:US9688661, 3-(5-Chloro-2-ethylphenyl)-N-methyl-5-(7H-pyrrolo[2,3-d]pyrimidin-4-yl)-1H-pyrrole-2-carboxamide (compd 130)
TypeSmall organic molecule
Emp. Form.C20H18ClN5O
Mol. Mass.379.843
SMILESCCc1ccc(Cl)cc1-c1cc(-c2ncnc3[nH]ccc23)n(C)c1C(N)=O