Reaction Details
TargetNon-receptor tyrosine-protein kinase TYK2 [833-1187]
LigandBDBM50069326
Substrate/Competitorn/a
Meas. Tech.TYK2 Kinase Assay
IC50 2.00±n/a nM
Citation Brasca, MGBindi, SCaldarelli, MNesi, MOrrenius, SCPanzeri, A Substituted pyrroles active as kinases inhibitors US Patent US9688661 Publication Date 6/27/2017
 
Non-receptor tyrosine-protein kinase TYK2 [833-1187]
Name:Non-receptor tyrosine-protein kinase TYK2 [833-1187]
Type:Protein
Mol. Mass.:40613.06
Organism:Homo sapiens (Human)
Description:Human TYK2 variant (833-1187 aa)
Residue:355
BDBM50069326
NameBDBM50069326
Synonyms:CHEMBL3403541 | US9688661, 1-(5-Chloro-2-methylphenyl)-4-(7H-pyrrolo[2,3-d]pyrimidin-4-yl)-1H-pyrrole-2-carboxamide (compd 229)
TypeSmall organic molecule
Emp. Form.C18H14ClN5O
Mol. Mass.351.79
SMILESCc1ccc(Cl)cc1-n1cc(cc1C(N)=O)-c1ncnc2[nH]ccc12