Reaction Details
TargetInterleukin-1 receptor-associated kinase 4
LigandBDBM302992
Substrate/Competitorn/a
Meas. Tech.Kinase Activity Assay
IC50 0.200±n/a nM
Citation Seganish, WMMcElroy, WTBrumfield, SHerr, RJYet, LYang, JHarding, III, JPHo, GDTulshian, DYu, WWong, MKLavey, BKozlowski, JA Inhibitors of IRAK4 activity US Patent US9598440 Publication Date 3/21/2017
 
Interleukin-1 receptor-associated kinase 4
Name:Interleukin-1 receptor-associated kinase 4
Type:Protein
Mol. Mass.:51519.08
Organism:Homo sapiens (Human)
Description:Q9NWZ3
Residue:460
BDBM302992
NameBDBM302992
Synonyms:US9598440, 133
TypeSmall organic molecule
Emp. Form.C23H30N6O3S
Mol. Mass.470.588
SMILESCc1csc(n1)-c1cnc(Nc2cc(C)nc(C)c2)nc1N[C@@H]1C[C@@H]([C@@H](O)[C@H]1O)C(C)(C)O