Reaction Details
TargetSerine/threonine-protein kinase pim-1
LigandBDBM376785
Substrate/Competitorn/a
Meas. Tech.Pim Enzyme Assays
IC50<10±n/a nM
Citation Vechorkin, OLi, YSokolsky, AWang, AZhu, WZhuo, J Heterocyclic compounds useful as Pim kinase inhibitors US Patent US11053215 Publication Date 7/6/2021
 
Serine/threonine-protein kinase pim-1
Name:Serine/threonine-protein kinase pim-1
Type:Protein
Mol. Mass.:35681.82
Organism:Homo sapiens (Human)
Description:P11309
Residue:313
BDBM376785
NameBDBM376785
Synonyms:N-(4-((1R,3S,5S)-3-Amino-5-methylcyclohexyl)pyridin-3-yl)-3-(3,3-dimethylazetidin-1-yl)-5-fluoroquinoline-8-carboxamide US11053215, Example 116 | US9920032, Example 116
TypeSmall organic molecule
Emp. Form.C27H32FN5O
Mol. Mass.461.5743
SMILESC[C@@H]1C[C@H](N)C[C@@H](C1)c1ccncc1NC(=O)c1ccc(F)c2cc(cnc12)N1CC(C)(C)C1