Reaction Details
TargetSerine/threonine-protein kinase pim-3
LigandBDBM376816
Substrate/Competitorn/a
Meas. Tech.Pim Enzyme Assays
IC50<10±n/a nM
Citation Vechorkin, OLi, YSokolsky, AWang, AZhu, WZhuo, J Heterocyclic compounds useful as Pim kinase inhibitors US Patent US11053215 Publication Date 7/6/2021
 
Serine/threonine-protein kinase pim-3
Name:Serine/threonine-protein kinase pim-3
Type:Protein
Mol. Mass.:35888.19
Organism:Homo sapiens (Human)
Description:Q86V86
Residue:326
BDBM376816
NameBDBM376816
Synonyms:N-(4-((1R,3S,5S)-3-Amino-5-methylcyclohexyl)pyridin-3-yl)-5-fluoro-3-(methyl(2-methylcyclobutyl)amino)quinoline-8-carboxamide US11053215, Example 147 | US9920032, Example 147
TypeSmall organic molecule
Emp. Form.C28H34FN5O
Mol. Mass.475.6009
SMILESCC1CCC1N(C)c1cnc2c(ccc(F)c2c1)C(=O)Nc1cnccc1[C@@H]1C[C@H](C)C[C@H](N)C1