Reaction Details
TargetMethylosome protein 50/Protein arginine N-methyltransferase 5
LigandBDBM515298
Substrate/Competitorn/a
Meas. Tech.Enzyme Methylation Assay
IC50 0.210±n/a nM
Citation Machacek, MRWitter, DJReutershan, MHSloman, DLAltman, MD PRMT5 inhibitors US Patent US11098059 Publication Date 8/24/2021
 
Methylosome protein 50/Protein arginine N-methyltransferase 5
Name:Methylosome protein 50/Protein arginine N-methyltransferase 5
Type:Protein
Mol. Mass.:n/a
Description:n/a
Components:This complex has 2 components.
Component 1
Name:Protein arginine N-methyltransferase 5
Synonyms:72 kDa ICln-binding protein HRMT1L5 IBP72 Jak-binding protein 1 PRMT5/MEP50 complex Protein arginine methyltransferase 5 (PRMT5) SKB1 homolog Shk1 kinase-binding protein 1 homolog
Type:Enzyme
Mol. Mass.:72679.99
Organism:Homo sapiens (Human)
Description:O14744
Residue:637
Component 2
Name:Methylosome protein 50
Synonyms:Androgen receptor cofactor p44 MEP50 Nbla10071 WD45 p44/Mep50
Type:Enzyme
Mol. Mass.:36713.38
Organism:Homo sapiens (Human)
Description:Q9BQA1
Residue:342
BDBM515298
NameBDBM515298
Synonyms:US11098059, Example 2 | US11098059, Example 6
TypeSmall organic molecule
Emp. Form.C22H25BrN2O2
Mol. Mass.429.35
SMILESCC[C@H]1CN(C[C@H](O)[C@@H]2Cc3ccccc3CN2)C(=O)c2ccc(Br)cc12