Reaction Details
TargetMethylosome protein 50/Protein arginine N-methyltransferase 5
LigandBDBM515323
Substrate/Competitorn/a
Meas. Tech.Enzyme Methylation Assay
IC50 0.350±n/a nM
Citation Machacek, MRWitter, DJReutershan, MHSloman, DLAltman, MD PRMT5 inhibitors US Patent US11098059 Publication Date 8/24/2021
 
Methylosome protein 50/Protein arginine N-methyltransferase 5
Name:Methylosome protein 50/Protein arginine N-methyltransferase 5
Type:Protein
Mol. Mass.:n/a
Description:n/a
Components:This complex has 2 components.
Component 1
Name:Protein arginine N-methyltransferase 5
Synonyms:72 kDa ICln-binding protein HRMT1L5 IBP72 Jak-binding protein 1 PRMT5/MEP50 complex Protein arginine methyltransferase 5 (PRMT5) SKB1 homolog Shk1 kinase-binding protein 1 homolog
Type:Enzyme
Mol. Mass.:72679.99
Organism:Homo sapiens (Human)
Description:O14744
Residue:637
Component 2
Name:Methylosome protein 50
Synonyms:Androgen receptor cofactor p44 MEP50 Nbla10071 WD45 p44/Mep50
Type:Enzyme
Mol. Mass.:36713.38
Organism:Homo sapiens (Human)
Description:Q9BQA1
Residue:342
BDBM515323
NameBDBM515323
Synonyms:6-(hexahydro-3,6- epiminofuro[3,2-b]furan- 7-carbonyl)-2-((R)-2- hydroxy-2-((S)-1,2,3,4- tetrahydroisoquinolin-3- yl)ethyl)-4,4-dimethyl- 3,4-dihydroisoquinolin- 1(2H)-one | US11098059, Example 27
TypeSmall organic molecule
Emp. Form.C29H33N3O5
Mol. Mass.503.5894
SMILESCC1(C)CN(C[C@@H](O)[C@@H]2Cc3ccccc3CN2)C(=O)c2ccc(cc12)C(=O)N1C2COC3C1COC23