Reaction Details
TargetToll-like receptor 8
LigandBDBM427673
Substrate/Competitorn/a
Meas. Tech.TLR7/8/9 Inhibition Reporter Assays
IC50 0.150±n/a nM
Citation Dyckman, AJDodd, DSMussari, CPSherwood, TCWhiteley, BKGilmore, JLKumar, SRPasunoori, LSrinivas, PVDuraisamy, SKHegde, SAnumula, RK 4-azaindole compounds US Patent US11053244 Publication Date 7/6/2021
 
Toll-like receptor 8
Name:Toll-like receptor 8
Type:Enzyme
Mol. Mass.:119828.77
Organism:Homo sapiens (Human)
Description:Q9NR97
Residue:1041
BDBM427673
NameBDBM427673
Synonyms:1-(4-(2-(7,8-dimethyl-[1,2,4]triazolo[1,5-a]pyridin-6-yl)-3-isopropyl-1H-pyrrolo[3,2-b]pyridin-5-yl)piperazin-1-yl)-2-methylpropan-2-ol US10730877, Example 105 | US11053244, Example 105
TypeSmall organic molecule
Emp. Form.C26H35N7O
Mol. Mass.461.6024
SMILESCC(C)c1c([nH]c2ccc(nc12)N1CCN(CC(C)(C)O)CC1)-c1cn2ncnc2c(C)c1C