Reaction Details
TargetToll-like receptor 7
LigandBDBM427891
Substrate/Competitorn/a
Meas. Tech.TLR7/8/9 Inhibition Reporter Assays
IC50 0.130±n/a nM
Citation Dyckman, AJDodd, DSMussari, CPSherwood, TCWhiteley, BKGilmore, JLKumar, SRPasunoori, LSrinivas, PVDuraisamy, SKHegde, SAnumula, RK 4-azaindole compounds US Patent US11053244 Publication Date 7/6/2021
 
Toll-like receptor 7
Name:Toll-like receptor 7
Type:Enzyme
Mol. Mass.:120945.35
Organism:Homo sapiens (Human)
Description:Q9NYK1
Residue:1049
BDBM427891
NameBDBM427891
Synonyms:US10544143, Example 325 US10730877, Example 326 | US11053244, Example 326
TypeSmall organic molecule
Emp. Form.C27H34N6O
Mol. Mass.458.5985
SMILESCOc1cc(cn2ncnc12)-c1[nH]c2cc(C)c(nc2c1C(C)C)C1CCC(CC1)N1CCC1