Reaction Details
TargetToll-like receptor 7
LigandBDBM516908
Substrate/Competitorn/a
Meas. Tech.TLR7/8/9 Inhibition Reporter Assays
IC50 0.080±n/a nM
Citation Dyckman, AJDodd, DSMussari, CPSherwood, TCWhiteley, BKGilmore, JLKumar, SRPasunoori, LSrinivas, PVDuraisamy, SKHegde, SAnumula, RK 4-azaindole compounds US Patent US11053244 Publication Date 7/6/2021
 
Toll-like receptor 7
Name:Toll-like receptor 7
Type:Enzyme
Mol. Mass.:120945.35
Organism:Homo sapiens (Human)
Description:Q9NYK1
Residue:1049
BDBM516908
NameBDBM516908
Synonyms:US11053244, Example 328 | US11053244, Example 329
TypeSmall organic molecule
Emp. Form.C28H38N6O2
Mol. Mass.490.6403
SMILESCOc1cc(c[nH]\c1=N/C=N)-c1[nH]c2cc(C)c(nc2c1C(C)C)C1CCC(CC1)NC1CCOC1