Reaction Details
TargetToll-like receptor 8
LigandBDBM428465
Substrate/Competitorn/a
Meas. Tech.TLR7/8/9 Inhibition Reporter Assays
IC50 0.150±n/a nM
Citation Dyckman, AJDodd, DSMussari, CPSherwood, TCWhiteley, BKGilmore, JLKumar, SRPasunoori, LSrinivas, PVDuraisamy, SKHegde, SAnumula, RK 4-azaindole compounds US Patent US11053244 Publication Date 7/6/2021
 
Toll-like receptor 8
Name:Toll-like receptor 8
Type:Enzyme
Mol. Mass.:119828.77
Organism:Homo sapiens (Human)
Description:Q9NR97
Residue:1041
BDBM428465
NameBDBM428465
Synonyms:US10544143, Example 901 US11053244, Example 901
TypeSmall organic molecule
Emp. Form.C30H38N8O2
Mol. Mass.542.6751
SMILESCC(C)c1c([nH]c2ccc(nc12)N1CCN(C[C@@H]1C)C(=O)CN1CC2(COC2)C1)-c1cn2ncnc2c(C)c1C