Reaction Details
TargetToll-like receptor 8
LigandBDBM428533
Substrate/Competitorn/a
Meas. Tech.TLR7/8/9 Inhibition Reporter Assays
IC50 0.120±n/a nM
Citation Dyckman, AJDodd, DSMussari, CPSherwood, TCWhiteley, BKGilmore, JLKumar, SRPasunoori, LSrinivas, PVDuraisamy, SKHegde, SAnumula, RK 4-azaindole compounds US Patent US11053244 Publication Date 7/6/2021
 
Toll-like receptor 8
Name:Toll-like receptor 8
Type:Enzyme
Mol. Mass.:119828.77
Organism:Homo sapiens (Human)
Description:Q9NR97
Residue:1041
BDBM428533
NameBDBM428533
Synonyms:US10544143, Example 969 US11053244, Example 969
TypeSmall organic molecule
Emp. Form.C27H36N8O2
Mol. Mass.504.6271
SMILESCC(C)c1c([nH]c2ccc(nc12)N1CCN(CC1)C(=O)CN(C)CCO)-c1cn2ncnc2c(C)c1C