Reaction Details
TargetToll-like receptor 8
LigandBDBM428547
Substrate/Competitorn/a
Meas. Tech.TLR7/8/9 Inhibition Reporter Assays
IC50 0.120±n/a nM
Citation Dyckman, AJDodd, DSMussari, CPSherwood, TCWhiteley, BKGilmore, JLKumar, SRPasunoori, LSrinivas, PVDuraisamy, SKHegde, SAnumula, RK 4-azaindole compounds US Patent US11053244 Publication Date 7/6/2021
 
Toll-like receptor 8
Name:Toll-like receptor 8
Type:Enzyme
Mol. Mass.:119828.77
Organism:Homo sapiens (Human)
Description:Q9NR97
Residue:1041
BDBM428547
NameBDBM428547
Synonyms:US10544143, Example 983 US11053244, Example 983
TypeSmall organic molecule
Emp. Form.C25H33N7
Mol. Mass.431.5764
SMILESCC(C)[C@H]1CN(CCN1)c1ccc2[nH]c(c(C(C)C)c2n1)-c1cn2ncnc2c(C)c1C