Reaction Details
TargetN-formyl peptide receptor 2
LigandBDBM517783
Substrate/Competitorn/a
Meas. Tech.FPR2 and FPR1 Cyclic Adenosine Monophosphate (cAMP) Assays
EC50 0.210±n/a nM
Citation Shirude, PSChattopadhyay, AKWurtz, NR Aryl heterocyclic piperidinone formyl peptide 2 receptor and formyl peptide 1 receptor agonists US Patent US11124494 Publication Date 9/21/2021
 
N-formyl peptide receptor 2
Name:N-formyl peptide receptor 2
Type:G Protein-Coupled Receptor (GPCR)
Mol. Mass.:38968.35
Organism:Homo sapiens (Human)
Description:P25090
Residue:351
BDBM517783
NameBDBM517783
Synonyms:US11124494, Example 42
TypeSmall organic molecule
Emp. Form.C24H27F3N4O4S
Mol. Mass.524.556
SMILESCS(=O)(=O)NCC1(CC1)c1ccc(cc1)N1CCC[C@@H](NC(=O)Nc2ccc(cc2)C(F)(F)F)C1=O