Reaction Details
TargetMu-type opioid receptor
LigandBDBM518586
Substrate/Competitorn/a
Meas. Tech.Detection of MOR cAMP Agonist Activity
EC50 0.100±n/a nM
Citation Zhang, YWu, WYang, GLi, ZSun, JLi, JLi, JChen, S 2,6-dioxaspiro [4,5] decane derivatives and preparation method therefor and pharmaceutical applications thereof US Patent US11124523 Publication Date 9/21/2021
 
Mu-type opioid receptor
Name:Mu-type opioid receptor
Type:G Protein-Coupled Receptor (GPCR)
Mol. Mass.:44789.51
Organism:Homo sapiens (Human)
Description:P35372
Residue:400
BDBM518586
NameBDBM518586
Synonyms:US11124523, Example (+)-22
TypeSmall organic molecule
Emp. Form.C23H29FN2O2
Mol. Mass.384.487
SMILESCc1cccc(CNCC[C@]2(CCO[C@]3(CCOC3)C2)c2ccc(F)cn2)c1