Reaction Details
TargetN-formyl peptide receptor 2
LigandBDBM450307
Substrate/Competitorn/a
Meas. Tech.Biological Assay
EC50 0.077±n/a nM
Citation Shirude, PSBaligar, VSeshadri, BChattopadhyay, AKWurtz, NRKick, EK Phenylpyrrolidinone formyl peptide 2 receptor agonists US Patent US11117861 Publication Date 9/14/2021
 
N-formyl peptide receptor 2
Name:N-formyl peptide receptor 2
Type:G Protein-Coupled Receptor (GPCR)
Mol. Mass.:38968.35
Organism:Homo sapiens (Human)
Description:P25090
Residue:351
BDBM450307
NameBDBM450307
Synonyms:US10676431, Example 70 | US11117861, Example 70
TypeSmall organic molecule
Emp. Form.C25H21ClF4N3O3P
Mol. Mass.553.873
SMILESCP(C)(=O)c1c(F)cccc1-c1ccc(N2CC[C@@H](NC(=O)Nc3ccc(Cl)cc3F)C2=O)c(F)c1F