Reaction Details
TargetN-formyl peptide receptor 2
LigandBDBM450350
Substrate/Competitorn/a
Meas. Tech.Biological Assay
EC50 0.390±n/a nM
Citation Shirude, PSBaligar, VSeshadri, BChattopadhyay, AKWurtz, NRKick, EK Phenylpyrrolidinone formyl peptide 2 receptor agonists US Patent US11117861 Publication Date 9/14/2021
 
N-formyl peptide receptor 2
Name:N-formyl peptide receptor 2
Type:G Protein-Coupled Receptor (GPCR)
Mol. Mass.:38968.35
Organism:Homo sapiens (Human)
Description:P25090
Residue:351
BDBM450350
NameBDBM450350
Synonyms:US10676431, Example 113 | US11117861, Example 113
TypeSmall organic molecule
Emp. Form.C26H25ClF3N4O3P
Mol. Mass.564.924
SMILESCC1(C)CN(C(=O)[C@@H]1NC(=O)Nc1ccc(Cl)cc1F)c1ccc(c(F)c1F)-c1cccnc1P(C)(C)=O