Reaction Details
TargetN-formyl peptide receptor 2
LigandBDBM450358
Substrate/Competitorn/a
Meas. Tech.Biological Assay
EC50 0.300±n/a nM
Citation Shirude, PSBaligar, VSeshadri, BChattopadhyay, AKWurtz, NRKick, EK Phenylpyrrolidinone formyl peptide 2 receptor agonists US Patent US11117861 Publication Date 9/14/2021
 
N-formyl peptide receptor 2
Name:N-formyl peptide receptor 2
Type:G Protein-Coupled Receptor (GPCR)
Mol. Mass.:38968.35
Organism:Homo sapiens (Human)
Description:P25090
Residue:351
BDBM450358
NameBDBM450358
Synonyms:US10676431, Example 121 US11117861, Example 122
TypeSmall organic molecule
Emp. Form.C25H23ClF3N4O3P
Mol. Mass.550.897
SMILESCC1C[C@@H](NC(=O)Nc2ccc(Cl)cc2F)C(=O)N1c1ccc(c(F)c1F)-c1cccnc1P(C)(C)=O