Reaction Details
TargetAmyloid-beta precursor protein
LigandBDBM50052701
Substrate/Competitorn/a
Meas. Tech.Radiolabeling of ThT and Radioligand Binding Assay
Ki 30.0±n/a nM
Citation Klunk, WEMathis, Jr., CAWang, Y Thioflavin derivatives for use in antemortem diagnosis of Alzheimer's disease and in vivo imaging and prevention of amyloid deposition US Patent US10137210 Publication Date 11/27/2018
 
Amyloid-beta precursor protein
Name:Amyloid-beta precursor protein
Type:Single-pass type I membrane protein
Mol. Mass.:86890.41
Organism:Homo sapiens (Human)
Description:P05067
Residue:770
BDBM50052701
NameBDBM50052701
Synonyms:2-(4-Aminophenyl)-6-methoxybenzothiazole CHEMBL92390 | US10137210, Example 6-11CH3O-BTA-0
TypeSmall organic molecule
Emp. Form.C14H12N2OS
Mol. Mass.256.323
SMILESCOc1ccc2nc(sc2c1)-c1ccc(N)cc1