Reaction Details
TargetVasopressin V1a receptor
LigandBDBM521148
Substrate/Competitorn/a
Meas. Tech.Cellular In Vitro Assay for Determining Vasopressin Receptor Activity
IC50 1.40±n/a nM
Citation Collin-Kroepelin, MKolkhof, PNeubauer, TFuerstner, CPook, EWittwer, MBSchirmer, HTinel, H Substituted triazole derivatives and uses thereof US Patent US11149023 Publication Date 10/19/2021
 
Vasopressin V1a receptor
Name:Vasopressin V1a receptor
Type:Receptor
Mol. Mass.:46820.18
Organism:Homo sapiens (Human)
Description:P37288
Residue:418
BDBM521148
NameBDBM521148
Synonyms:US11149023, Example 43
TypeSmall organic molecule
Emp. Form.C24H18Cl2F6N8O2
Mol. Mass.635.349
SMILESFC(F)(F)[C@H](Cn1c(nn(Cc2ncn(n2)-c2ncccc2Cl)c1=O)-c1ccc(Cl)cc1)NC(=O)C1(CC1)C(F)(F)F