Reaction Details
TargetVasopressin V1a receptor
LigandBDBM521152
Substrate/Competitorn/a
Meas. Tech.Cellular In Vitro Assay for Determining Vasopressin Receptor Activity
IC50 1.85±n/a nM
Citation Collin-Kroepelin, MKolkhof, PNeubauer, TFuerstner, CPook, EWittwer, MBSchirmer, HTinel, H Substituted triazole derivatives and uses thereof US Patent US11149023 Publication Date 10/19/2021
 
Vasopressin V1a receptor
Name:Vasopressin V1a receptor
Type:Receptor
Mol. Mass.:46820.18
Organism:Homo sapiens (Human)
Description:P37288
Residue:418
BDBM521152
NameBDBM521152
Synonyms:N-{3-[3-(4-Chlorophenyl)-1-{[1-(3-chloropyridin-2-yl)-1H-1,2,4-triazol-3-yl]methyl}-5-oxo-1,5-dihydro-4H-1,2,4-triazol-4-yl]-1,1,1-trifluoropropan-2-yl}-prolinamide (Diastereomeric Mixture) | US11149023, Example 47
TypeSmall organic molecule
Emp. Form.C24H22Cl2F3N9O2
Mol. Mass.596.392
SMILESFC(F)(F)C(Cn1c(nn(Cc2ncn(n2)-c2ncccc2Cl)c1=O)-c1ccc(Cl)cc1)NC(=O)C1CCCN1