Reaction Details
TargetTyrosine-protein kinase BTK
LigandBDBM521782
Substrate/Competitorn/a
Meas. Tech.Enzymatic Activity Assay
IC50 0.300±n/a nM
Citation Goldstein, DMOwens, TD Heterocycle comprising tyrosine kinase inhibitors US Patent US11155544 Publication Date 10/26/2021
 
Tyrosine-protein kinase BTK
Name:Tyrosine-protein kinase BTK
Type:Enzyme
Mol. Mass.:76289.95
Organism:Homo sapiens (Human)
Description:Q06187
Residue:659
BDBM521782
NameBDBM521782
Synonyms:US11155544, Compound 8
TypeSmall organic molecule
Emp. Form.C37H42FN9O3
Mol. Mass.679.7863
SMILESCC(C)(C=C(C#N)C(=O)N1CCC[C@H](C1)n1nc(-c2ccc(Oc3ccccc3)cc2F)c2c(N)ncnc12)N1CCN(CC1)C1(C)COC1