Reaction Details
TargetTyrosine-protein kinase BTK
LigandBDBM521802
Substrate/Competitorn/a
Meas. Tech.Enzymatic Activity Assay
IC50 0.800±n/a nM
Citation Goldstein, DMOwens, TD Heterocycle comprising tyrosine kinase inhibitors US Patent US11155544 Publication Date 10/26/2021
 
Tyrosine-protein kinase BTK
Name:Tyrosine-protein kinase BTK
Type:Enzyme
Mol. Mass.:76289.95
Organism:Homo sapiens (Human)
Description:Q06187
Residue:659
BDBM521802
NameBDBM521802
Synonyms:US11155544, Compound 29
TypeSmall organic molecule
Emp. Form.C37H40F2N8O3
Mol. Mass.682.7621
SMILESCC(C)(C=C(C#N)C(=O)N1CCC[C@H](C1)n1nc(-c2ccc(Oc3cccc(F)c3F)cc2)c2c(N)nccc12)N1CCN(CC1)C1COC1