Reaction Details
TargetTyrosine-protein kinase BTK
LigandBDBM521833
Substrate/Competitorn/a
Meas. Tech.Enzymatic Activity Assay
IC50 0.600±n/a nM
Citation Goldstein, DMOwens, TD Heterocycle comprising tyrosine kinase inhibitors US Patent US11155544 Publication Date 10/26/2021
 
Tyrosine-protein kinase BTK
Name:Tyrosine-protein kinase BTK
Type:Enzyme
Mol. Mass.:76289.95
Organism:Homo sapiens (Human)
Description:Q06187
Residue:659
BDBM521833
NameBDBM521833
Synonyms:US11155544, Compound 65
TypeSmall organic molecule
Emp. Form.C37H40N8O3
Mol. Mass.644.7653
SMILESCC(C)(C=C(C#N)C(=O)N1CCC[C@H](C1)c1nc(-c2ccc(Oc3ccccc3)cc2)c2c(N)nccn12)N1CCN2[C@H](CCC2=O)C1