Reaction Details
TargetTyrosine-protein kinase BTK
LigandBDBM521834
Substrate/Competitorn/a
Meas. Tech.Enzymatic Activity Assay
IC50 0.300±n/a nM
Citation Goldstein, DMOwens, TD Heterocycle comprising tyrosine kinase inhibitors US Patent US11155544 Publication Date 10/26/2021
 
Tyrosine-protein kinase BTK
Name:Tyrosine-protein kinase BTK
Type:Enzyme
Mol. Mass.:76289.95
Organism:Homo sapiens (Human)
Description:Q06187
Residue:659
BDBM521834
NameBDBM521834
Synonyms:US11155544, Compound 66
TypeSmall organic molecule
Emp. Form.C31H33N7O2
Mol. Mass.535.6394
SMILESCN1CCN(C[C@@H]1c1nc(-c2ccc(Oc3ccccc3)cc2)c2c(N)nccn12)C(=O)C(=CC(C)(C)C)C#N