Reaction Details
TargetReceptor-interacting serine/threonine-protein kinase 2
LigandBDBM303431
Substrate/Competitorn/a
Meas. Tech.V9103X ADP-Glo Kinase Assay Custom
IC50 1.80±n/a nM
Citation Cui, JGao, DALiu, PMcKibben, BPMiller, CARazavi, HSpencer, ERuppel, SPadyana, AK Substituted benzamides as RIPK2 inhibitors US Patent US10138222 Publication Date 11/27/2018
 
Receptor-interacting serine/threonine-protein kinase 2
Name:Receptor-interacting serine/threonine-protein kinase 2
Type:Protein
Mol. Mass.:61201.30
Organism:Homo sapiens (Human)
Description:n/a
Residue:540
BDBM303431
NameBDBM303431
Synonyms:US10138222, Example 159
TypeSmall organic molecule
Emp. Form.C29H36N6O2
Mol. Mass.500.6351
SMILESCC1OCCC1N1CCC(CC1)Nc1cncc(c1)-n1cc(cn1)-c1cc(ccc1C)C(=O)NC1CC1