Reaction Details
TargetThioredoxin reductase 1, cytoplasmic
LigandBDBM522153
Substrate/Competitorn/a
Meas. Tech.Inhibition of Recombinant TrxR1
IC50 333±n/a nM
Citation Pelcman, BSuna, EStafford, WPriede, M Hydrocarbylsulfonyl-substituted pyridines and their use in the treatment of cancer US Patent US11161815 Publication Date 11/2/2021
 
Thioredoxin reductase 1, cytoplasmic
Name:Thioredoxin reductase 1, cytoplasmic
Type:Protein
Mol. Mass.:70761.78
Organism:Homo sapiens (Human)
Description:Q16881
Residue:648
BDBM522153
NameBDBM522153
Synonyms:US11161815, Example 9
TypeSmall organic molecule
Emp. Form.C13H21N3O4S
Mol. Mass.315.389
SMILESCCCCCCS(=O)(=O)c1nc(ccc1[N+]([O-])=O)N(C)C