Reaction Details
TargetThioredoxin reductase 1, cytoplasmic
LigandBDBM522169
Substrate/Competitorn/a
Meas. Tech.Inhibition of Recombinant TrxR1
IC50 1.03±n/a nM
Citation Pelcman, BSuna, EStafford, WPriede, M Hydrocarbylsulfonyl-substituted pyridines and their use in the treatment of cancer US Patent US11161815 Publication Date 11/2/2021
 
Thioredoxin reductase 1, cytoplasmic
Name:Thioredoxin reductase 1, cytoplasmic
Type:Protein
Mol. Mass.:70761.78
Organism:Homo sapiens (Human)
Description:Q16881
Residue:648
BDBM522169
NameBDBM522169
Synonyms:US11161815, Example 25
TypeSmall organic molecule
Emp. Form.C14H11F3N2O6S
Mol. Mass.392.307
SMILESCOc1ccc(c(n1)S(=O)(=O)Cc1ccc(OC(F)(F)F)cc1)[N+]([O-])=O