Reaction Details
TargetThioredoxin reductase 1, cytoplasmic
LigandBDBM524188
Substrate/Competitorn/a
Meas. Tech.Inhibition Assay
IC50 93.0±n/a nM
Citation Pelcman, BStafford, W Heterocyclylsulfonyl-substituted pyridines and their use in the treatment of cancer US Patent US11168069 Publication Date 11/9/2021
 
Thioredoxin reductase 1, cytoplasmic
Name:Thioredoxin reductase 1, cytoplasmic
Type:Protein
Mol. Mass.:70761.78
Organism:Homo sapiens (Human)
Description:Q16881
Residue:648
BDBM524188
NameBDBM524188
Synonyms:US11168069, Example 1
TypeSmall organic molecule
Emp. Form.C11H14N2O6S
Mol. Mass.302.304
SMILESCOc1ccc(c(n1)S(=O)(=O)C1CCOC1C)[N+]([O-])=O