Reaction Details
TargetGlycogen synthase kinase-3 beta
LigandBDBM385115
Substrate/Competitorn/a
Meas. Tech.Kinase Assay
EC50 3.00±n/a nM
Citation KC, SKMittapalli, GKHofilena, BJMarakovits, JTChiruta, CMak, CCCao, J Isoquinolin-3-yl carboxamides and preparation and use thereof US Patent US11174244 Publication Date 11/16/2021
 
Glycogen synthase kinase-3 beta
Name:Glycogen synthase kinase-3 beta
Type:Enzyme
Mol. Mass.:46756.38
Organism:Homo sapiens (Human)
Description:P49841
Residue:420
BDBM385115
NameBDBM385115
Synonyms:US10287267, Compound 271 US10556885, Compound 271 US11673881, Compound 271
TypeSmall organic molecule
Emp. Form.C21H23F3N6O
Mol. Mass.432.4421
SMILESCn1cc(nn1)-c1ccc2cnc(NC(=O)C3CCN(CCC(F)(F)F)CC3)cc2c1