Reaction Details
TargetGlycogen synthase kinase-3 beta
LigandBDBM385215
Substrate/Competitorn/a
Meas. Tech.Kinase Assay
EC50 4.00±n/a nM
Citation KC, SKMittapalli, GKHofilena, BJMarakovits, JTChiruta, CMak, CCCao, J Isoquinolin-3-yl carboxamides and preparation and use thereof US Patent US11174244 Publication Date 11/16/2021
 
Glycogen synthase kinase-3 beta
Name:Glycogen synthase kinase-3 beta
Type:Enzyme
Mol. Mass.:46756.38
Organism:Homo sapiens (Human)
Description:P49841
Residue:420
BDBM385215
NameBDBM385215
Synonyms:US10287267, Compound 470 US10556885, Compound 470 US11673881, Compound 470
TypeSmall organic molecule
Emp. Form.C23H25F3N6O
Mol. Mass.458.4794
SMILESCn1cc(nn1)-c1ccc2cnc(NC(=O)C3CCN(CC4(CC4)C(F)(F)F)CC3)cc2c1