Reaction Details
TargetN-formyl peptide receptor 2
LigandBDBM454187
Substrate/Competitorn/a
Meas. Tech.FPR2 and FPR1 Cyclic Adenosine Monophosphate (cAMP) Assays
EC50 0.320±n/a nM
Citation Wurtz, NRShirude, PSViet, AQ Piperidinone formyl peptide 2 receptor and formyl peptide 1 receptor agonists US Patent US11186544 Publication Date 11/30/2021
 
N-formyl peptide receptor 2
Name:N-formyl peptide receptor 2
Type:G Protein-Coupled Receptor (GPCR)
Mol. Mass.:38968.35
Organism:Homo sapiens (Human)
Description:P25090
Residue:351
BDBM454187
NameBDBM454187
Synonyms:US10717708, Example 66 US11530183, Example 66
TypeSmall organic molecule
Emp. Form.C26H25F3N4O4S
Mol. Mass.546.561
SMILESCS(=O)(=O)Nc1ccccc1-c1ccc(cc1)N1CCC[C@@H](NC(=O)Nc2ccc(cc2)C(F)(F)F)C1=O