Reaction Details
TargetN-formyl peptide receptor 2
LigandBDBM526315
Substrate/Competitorn/a
Meas. Tech.FPR2 and FPR1 Cyclic Adenosine Monophosphate (cAMP) Assays
EC50 0.350±n/a nM
Citation Wurtz, NRShirude, PSViet, AQ Piperidinone formyl peptide 2 receptor and formyl peptide 1 receptor agonists US Patent US11186544 Publication Date 11/30/2021
 
N-formyl peptide receptor 2
Name:N-formyl peptide receptor 2
Type:G Protein-Coupled Receptor (GPCR)
Mol. Mass.:38968.35
Organism:Homo sapiens (Human)
Description:P25090
Residue:351
BDBM526315
NameBDBM526315
Synonyms:US11186544, Example 211
TypeSmall organic molecule
Emp. Form.C25H25ClN4O5S
Mol. Mass.529.008
SMILESCS(=O)(=O)Nc1ccccc1-c1ccc(cc1)N1C[C@H](O)C[C@@H](NC(=O)Nc2ccc(Cl)cc2)C1=O