Reaction Details
TargetcAMP and cAMP-inhibited cGMP 3',5'-cyclic phosphodiesterase 10A
LigandBDBM304035
Substrate/Competitorn/a
Meas. Tech. Assay of Phosphodiesterase 10 Inhibition In Vitro
IC50 172±n/a nM
Citation Moszczynski-Petkowski, RBojarski, LWieczorek, MMajer, JJanowska, SMatloka, MBorkowska, MStefaniak, FLamparska-Przybysz, MDubiel, K Fused triazole derivatives as phosphodiesterase 10A inhibitors US Patent US10138245 Publication Date 11/27/2018
 
cAMP and cAMP-inhibited cGMP 3',5'-cyclic phosphodiesterase 10A
Name:cAMP and cAMP-inhibited cGMP 3',5'-cyclic phosphodiesterase 10A
Type:Protein
Mol. Mass.:88412.52
Organism:Homo sapiens (Human)
Description:Q9Y233
Residue:1055
BDBM304035
NameBDBM304035
Synonyms:2-[2-(3-Fluorophenyl)-1H-benzimidazol-5-yl]-5,8-dimethyl[1,2,4]triazolo[1,5-a]pyrazine | US10138245, Example 6
TypeSmall organic molecule
Emp. Form.C20H15FN6
Mol. Mass.358.3717
SMILESCc1cnc(C)c2nc(nn12)-c1ccc2[nH]c(nc2c1)-c1cccc(F)c1