Reaction Details
TargetIsoform 1 of Metabotropic glutamate receptor 5 (5a)
LigandBDBM174127
Substrate/Competitorn/a
Meas. Tech.mGluR5 FLIPR Assay
EC50 4.70±n/a nM
Citation Degnan, APMaxwell, DHill, MDFang, HParker, MFYang, FBronson, JJMacor, JE Oxazolidinones as modulators of mGluR5 US Patent US9688669 Publication Date 6/27/2017
 
Isoform 1 of Metabotropic glutamate receptor 5 (5a)
Name:Isoform 1 of Metabotropic glutamate receptor 5 (5a)
Type:Enzyme
Mol. Mass.:128885.13
Organism:Homo sapiens (Human)
Description:P41594-2
Residue:1180
BDBM174127
NameBDBM174127
Synonyms:US9688669, Example 5
TypeSmall organic molecule
Emp. Form.C21H21FN2O2
Mol. Mass.352.402
SMILESCC(C)CCC#Cc1cncc(c1)[C@H]1NC(=O)O[C@@H]1c1cccc(F)c1