Reaction Details
TargetIsoform 1 of Metabotropic glutamate receptor 5 (5a)
LigandBDBM174306
Substrate/Competitorn/a
Meas. Tech.mGluR5 FLIPR Assay
EC50 69±n/a nM
Citation Degnan, APMaxwell, DHill, MDFang, HParker, MFYang, FBronson, JJMacor, JE Oxazolidinones as modulators of mGluR5 US Patent US9688669 Publication Date 6/27/2017
 
Isoform 1 of Metabotropic glutamate receptor 5 (5a)
Name:Isoform 1 of Metabotropic glutamate receptor 5 (5a)
Type:Enzyme
Mol. Mass.:128885.13
Organism:Homo sapiens (Human)
Description:P41594-2
Residue:1180
BDBM174306
NameBDBM174306
Synonyms:US9688669, Example 120
TypeSmall organic molecule
Emp. Form.C20H14F4N2O2
Mol. Mass.390.331
SMILESFc1ccc([C@H]2OC(=O)N[C@@H]2c2cncc(c2)C#CC2CC(F)(F)C2)c(F)c1