Reaction Details
TargetReceptor tyrosine-protein kinase erbB-2
LigandBDBM304239
Substrate/Competitorn/a
Meas. Tech.SKBR3 Cell Viability Assay for Antibody-Polymer-Drug Conjugates
IC50 1.50±n/a nM
Citation Yin, MThomas, JDYurkovetskiy, AVConlon, PRDu, BKelleher, EWLowinger, TBTang, S Pyrrolobenzodiazepines and conjugates thereof US Patent US10143695 Publication Date 12/4/2018
 
Receptor tyrosine-protein kinase erbB-2
Name:Receptor tyrosine-protein kinase erbB-2
Type:n/a
Mol. Mass.:137894.47
Organism:Homo sapiens (Human)
Description:P04626
Residue:1255
BDBM304239
NameBDBM304239
Synonyms:US10143695, Compound 6A
TypeSmall organic molecule
Emp. Form.C43H45N11O7
Mol. Mass.827.8869
SMILESCOc1cc2c(cc1OCCCC(=O)Nc1cn(C)c(n1)C(=O)Nc1cc(C(=O)Nc3cc(C(=O)N4Cc5ccc(N)cc5C4)n(C)c3)n(C)c1)N=C[C@@H]1CC(=C)CN1C2=O