Reaction Details
TargetReceptor tyrosine-protein kinase erbB-2
LigandBDBM304258
Substrate/Competitorn/a
Meas. Tech.SKBR3 Cell Viability Assay for Antibody-Polymer-Drug Conjugates
IC50 0.660±n/a nM
Citation Yin, MThomas, JDYurkovetskiy, AVConlon, PRDu, BKelleher, EWLowinger, TBTang, S Pyrrolobenzodiazepines and conjugates thereof US Patent US10143695 Publication Date 12/4/2018
 
Receptor tyrosine-protein kinase erbB-2
Name:Receptor tyrosine-protein kinase erbB-2
Type:n/a
Mol. Mass.:137894.47
Organism:Homo sapiens (Human)
Description:P04626
Residue:1255
BDBM304258
NameBDBM304258
Synonyms:US10143695, Compound 84
TypeSmall organic molecule
Emp. Form.C35H34N10O6
Mol. Mass.690.7079
SMILESCn1cc(NC(=O)c2nc(NC(=O)CCCOc3cc4N=C[C@@H]5CC(=C)CN5C(=O)c4cc3O)cn2C)cc1C(=O)Nc1cnc2[nH]ccc2c1