Reaction Details
TargetProto-oncogene tyrosine-protein kinase Src
LigandBDBM50345739
Substrate/Competitorn/a
Meas. Tech.KinaseGlo Assay
IC50 770±n/a nM
Citation Van Voorhis, WCHol, WGLarson, ETMaly, DJMerritt, EOjo, KK Compositions and methods for treating toxoplasmosis, cryptosporidiosis, and other apicomplexan protozoan related diseases US Patent US11247972 Publication Date 2/15/2022
 
Proto-oncogene tyrosine-protein kinase Src
Name:Proto-oncogene tyrosine-protein kinase Src
Type:Protein
Mol. Mass.:59838.60
Organism:Homo sapiens (Human)
Description:P12931
Residue:536
BDBM50345739
NameBDBM50345739
Synonyms:1-isopropyl-3-(6-methoxynaphthalen-2-yl)-1H-pyrazolo[3,4-d]pyrimidin-4-amine CHEMBL2070045 US11247972, Compound 7q | US9765037, Compound 7q
TypeSmall organic molecule
Emp. Form.C19H19N5O
Mol. Mass.333.3871
SMILESCOc1ccc2cc(ccc2c1)-c1nn(C(C)C)c2ncnc(N)c12