Reaction Details
TargetcGMP-dependent protein kinase
LigandBDBM50389687
Substrate/Competitorn/a
Meas. Tech.Luminescent Kinase Assay
IC50 0.600±n/a nM
Citation Van Voorhis, WCHol, WGLarson, ETMaly, DJMerritt, EOjo, KK Compositions and methods for treating toxoplasmosis, cryptosporidiosis, and other apicomplexan protozoan related diseases US Patent US11247972 Publication Date 2/15/2022
 
cGMP-dependent protein kinase
Name:cGMP-dependent protein kinase
Type:Protein
Mol. Mass.:111249.85
Organism:n/a
Description:Q8MMZ7
Residue:994
 
BDBM50389687
NameBDBM50389687
Synonyms:CHEMBL2070054 US11247972, Compound 41 | US9765037, Compound 41
TypeSmall organic molecule
Emp. Form.C21H21N5O
Mol. Mass.359.4243
SMILESCC(C)n1nc(-c2ccc3cc(OCC=C)ccc3c2)c2c(N)ncnc12