Reaction Details
TargetCalcium/calmodulin dependent protein kinase with a kinas domain and 4 calmodulin-like EF hands
LigandBDBM50389687
Substrate/Competitorn/a
Meas. Tech.Luminescent Kinase Assay
IC50 4.10±n/a nM
Citation Van Voorhis, WCHol, WGLarson, ETMaly, DJMerritt, EOjo, KK Compositions and methods for treating toxoplasmosis, cryptosporidiosis, and other apicomplexan protozoan related diseases US Patent US11247972 Publication Date 2/15/2022
 
Calcium/calmodulin dependent protein kinase with a kinas domain and 4 calmodulin-like EF hands
Name:Calcium/calmodulin dependent protein kinase with a kinas domain and 4 calmodulin-like EF hands
Synonyms:cGMP-dependent protein kinase (CpCDPK)
Type:Enzyme Catalytic Domain
Mol. Mass.:80612.61
Organism:Cryptosporidium parvum (strain Iowa II)
Description:Q5CTY5
Residue:718
BDBM50389687
NameBDBM50389687
TypeSmall organic molecule
Emp. Form.C21H21N5O
Mol. Mass.359.4243
SMILESCC(C)n1nc(-c2ccc3cc(OCC=C)ccc3c2)c2c(N)ncnc12