Reaction Details
TargetMonocarboxylate transporter 4
LigandBDBM345278
Substrate/Competitorn/a
Meas. Tech.Biological Activity Assay 3
IC50 30.0±n/a nM
Citation Parnell, KMMcCall, JRomero, D Heterocyclic inhibitors of MCT4 US Patent US11292767 Publication Date 4/5/2022
 
Monocarboxylate transporter 4
Name:Monocarboxylate transporter 4
Type:PROTEIN
Mol. Mass.:49474.36
Organism:Homo sapiens (Human)
Description:ChEMBL_104604
Residue:465
BDBM345278
NameBDBM345278
Synonyms:2-[[1-[(2-Chlorophenyl)methyl]-5-(3- thienyl)pyrazol-3-yl]methoxy]-2-methyl- propanoic acid. 1HNMR (CDCl3): $#948; 1.37 (s, 6H), 4.38 (s, 2H), 5.43 (s, 2H), 6.48 (s, 1H), 6.62-6.64 (m, 1H), 7.17-7.31 (m, 3H), 7.44-7.46 (m, 1H), 7.57-7.64 (m, 2H). US10214492, Example 24 US11724989, Example 24
TypeSmall organic molecule
Emp. Form.C19H19ClN2O3S
Mol. Mass.390.884
SMILESCC(C)(OCc1cc(-c2ccsc2)n(Cc2ccccc2Cl)n1)C(O)=O