Reaction Details
TargetMonocarboxylate transporter 4
LigandBDBM345298
Substrate/Competitorn/a
Meas. Tech.Biological Activity Assay 3
IC50 1.10±n/a nM
Citation Parnell, KMMcCall, JRomero, D Heterocyclic inhibitors of MCT4 US Patent US11292767 Publication Date 4/5/2022
 
Monocarboxylate transporter 4
Name:Monocarboxylate transporter 4
Type:PROTEIN
Mol. Mass.:49474.36
Organism:Homo sapiens (Human)
Description:ChEMBL_104604
Residue:465
BDBM345298
NameBDBM345298
Synonyms:2-[[1-[(2-Chlorophenyl)methyl]-5-[3- (cyclopentylmethoxy)phenyl]pyrazol-3- yl]methoxy]-2-methyl-propanoic acid. 1HNMR (CDCl3): $#948; 1.25-1.29 (m, 2H), 1.55-1.61 (m, 10H), 1.76-1.79 (m, 2H), 2.24-2.31 (m, 1H), 3.59 (d, 2H), 4.62 (s, 2H), 5.43 (s, 2H), 6.41 (s, 1H), 6.73-6.91 (m, 4H), 7.19-7.35 (m, 4H). US10214492, Example 44 US11724989, Example 44
TypeSmall organic molecule
Emp. Form.C27H31ClN2O4
Mol. Mass.482.999
SMILESCC(C)(OCc1cc(-c2cccc(OCC3CCCC3)c2)n(Cc2ccccc2Cl)n1)C(O)=O