Reaction Details
TargetGlucan 1,4-alpha-glucosidase
LigandBDBM23406
Substrate/Competitorn/a
Meas. Tech.Property Evaluation 3
IC50 126±6 nM
Citation Na, DHKang, KPJun, JHGo, GNa, HJKang, SJNa, YHYoon, SJNa, SJ Composition for inhibiting growth of SARS-CoV-2 and method of preparing the same US Patent US11292789 Publication Date 4/5/2022
 
Glucan 1,4-alpha-glucosidase
Name:Glucan 1,4-alpha-glucosidase
Type:Protein
Mol. Mass.:58125.45
Organism:Shiitake mushroom
Description:A0A1Q3E5G6
Residue:534
BDBM23406
NameBDBM23406
Synonyms:(3R,4R,5S,6R)-5-{[(2R,3R,4R,5S,6R)-5-{[(2R,3R,4S,5S,6R)-3,4-dihydroxy-6-methyl-5-{[(1S,4R,5S,6S)-4,5,6-trihydroxy-3-(hydroxymethyl)cyclohex-2-en-1-yl]amino}oxan-2-yl]oxy}-3,4-dihydroxy-6-(hydroxymethyl)oxan-2-yl]oxy}-6-(hydroxymethyl)oxane-2,3,4-triol US11292789, Acarbose
TypeCarbohydrate
Emp. Form.C25H43NO18
Mol. Mass.645.6048
SMILESC[C@H]1O[C@H](O[C@@H]2[C@@H](CO)O[C@H](O[C@@H]3[C@@H](CO)OC(O)[C@H](O)[C@H]3O)[C@H](O)[C@H]2O)[C@H](O)[C@@H](O)[C@@H]1N[C@H]1C=C(CO)[C@@H](O)[C@H](O)[C@H]1O