Reaction Details
TargetEpidermal growth factor receptor [1-18,20-1210,T790M]
LigandBDBM50029668
Substrate/Competitorn/a
Meas. Tech.pEGFR assay
IC50 1.60±n/a nM
Citation Harald, EMark, PJuergen, RUlrich, RHeinz, SDirk, STobias, W SUBSTITUTED 1H-PYRAZOLO[4,3-C]PYRIDINES AND DERIVATIVES AS EGFR INHIBITORS WIPOWO2022090481 Publication Date 5/5/2022
 
Epidermal growth factor receptor [1-18,20-1210,T790M]
Name:Epidermal growth factor receptor [1-18,20-1210,T790M]
Type:Enzyme Catalytic Domain
Mol. Mass.:134206.54
Organism:Homo sapiens (Human)
Description:P00533[1-18,20-1210,T790M]
Residue:1209
BDBM50029668
NameBDBM50029668
Synonyms:AZD-9291 US10085983, Compound AZD-9291 US11111233, Example AZD9291 US20230322822, Compound AZD9291 WO2022090481, Example osimertinib
TypeSmall organic molecule
Emp. Form.C28H33N7O2
Mol. Mass.499.6073
SMILESCOc1cc(N(C)CCN(C)C)c(NC(=O)C=C)cc1Nc1nccc(n1)-c1cn(C)c2ccccc12