Reaction Details
Target5-hydroxytryptamine receptor 2C
LigandBDBM322095
Substrate/Competitorn/a
Meas. Tech.5-HT2C Receptor Binding Assay
Ki 6.20±n/a nM
Citation Sasaki, IToyoda, TYoshinaga, HNatsutani, ITakahashi, Y Pyrazole compound US Patent US11312688 Publication Date 4/26/2022
 
5-hydroxytryptamine receptor 2C
Name:5-hydroxytryptamine receptor 2C
Type:G Protein-Coupled Receptor (GPCR)
Mol. Mass.:51836.79
Organism:Homo sapiens (Human)
Description:P28335
Residue:458
BDBM322095
NameBDBM322095
Synonyms:1-{5-[(5-chloro-2-fluorobenzyl)oxy]-1-(2,2-dimethylpropyl)-1H-pyrazol-3-yl}-N-methylmethanamine US11312688, Example 259 | US11576897, Example 259
TypeSmall organic molecule
Emp. Form.C17H23ClFN3O
Mol. Mass.339.835
SMILESCNCc1cc(OCc2cc(Cl)ccc2F)n(CC(C)(C)C)n1