Reaction Details
TargetApoptosis regulator Bcl-2
LigandBDBM60828
Substrate/Competitorn/a
Meas. Tech.Binding Assay
Kd<10±n/a nM
Citation Pinchman, JRHuang, PQBunker, KDSit, RKSamatar, AA Benzamide compounds US Patent US11318134 Publication Date 5/3/2022
 
Apoptosis regulator Bcl-2
Name:Apoptosis regulator Bcl-2
Type:Homodimer or heterodimer
Mol. Mass.:26269.11
Organism:Homo sapiens (Human)
Description:P10415
Residue:239
BDBM60828
NameBDBM60828
Synonyms:ABT-199 US10213433, Compound 5 US11318134, Example ABT-199 US11590126, Example ABT-199 US20240043404, Example 369 | US9174982, 369
Typen/a
Emp. Form.C45H50ClN7O7S
Mol. Mass.868.439
SMILESCC1(C)CCC(CN2CCN(CC2)c2ccc(C(=O)NS(=O)(=O)c3ccc(NCC4CCOCC4)c(c3)[N+]([O-])=O)c(Oc3cnc4[nH]ccc4c3)c2)=C(C1)c1ccc(Cl)cc1