Reaction Details
TargetApoptosis regulator Bcl-2
LigandBDBM189557
Substrate/Competitorn/a
Meas. Tech.TBDTR-FRET (Time-Resolved Fluorescence-Resonance-Energy-Transfer) Assay
Ki<0.010±n/a nM
Citation Birtalan, EHoelig, PLindley, DJSanzgiri, YDTong, P Melt-extruded solid dispersions containing an apoptosis-inducing agent US Patent US11369599 Publication Date 6/28/2022
 
Apoptosis regulator Bcl-2
Name:Apoptosis regulator Bcl-2
Type:Homodimer or heterodimer
Mol. Mass.:26269.11
Organism:Homo sapiens (Human)
Description:P10415
Residue:239
BDBM189557
NameBDBM189557
Synonyms:US10213433, Compound 119 US20240043404, Example 119 | US9174982, 119
TypeSmall organic molecule
Emp. Form.C45H48ClFN6O8S
Mol. Mass.887.414
SMILESCC1(C)CCC(=C(CN2CCN(CC2)c2ccc(C(=O)NS(=O)(=O)c3ccc(OCC4(F)CCOCC4)c(c3)[N+]([O-])=O)c(Oc3cnc4[nH]ccc4c3)c2)C1)c1ccc(Cl)cc1